Reaction Details
TargetCarbonic anhydrase 12
LigandBDBM50240178
Substrate/Competitorn/a
Meas. Tech.ChEMBL_1667780 (CHEMBL4017668)
Ki 7.1±n/a nM
Citation Carta, FVullo, DOsman, SMAlOthman, ZSupuran, CT Synthesis and carbonic anhydrase inhibition of a series of SLC-0111 analogs. Bioorg Med Chem25:2569-2576 (2017) 
 
Carbonic anhydrase 12
Name:Carbonic anhydrase 12
Type:Enzyme
Mol. Mass.:39456.00
Organism:Homo sapiens (Human)
Description:Catalytic domain of human cloned isozyme was used in the assay
Residue:354
BDBM50240178
NameBDBM50240178
Synonyms:CHEMBL4090086 | US9962398, Compound MST-142
TypeSmall organic molecule
Emp. Form.C13H11F2N3O3S
Mol. Mass.327.307
SMILESNS(=O)(=O)c1ccc(NC(=O)Nc2ccc(F)cc2F)cc1