Reaction Details
TargetCarbonic anhydrase 9
LigandBDBM50240179
Substrate/Competitorn/a
Meas. Tech.ChEMBL_1667779 (CHEMBL4017667)
Ki 7.7±n/a nM
Citation Carta, FVullo, DOsman, SMAlOthman, ZSupuran, CT Synthesis and carbonic anhydrase inhibition of a series of SLC-0111 analogs. Bioorg Med Chem25:2569-2576 (2017) 
 
Carbonic anhydrase 9
Name:Carbonic anhydrase 9
Type:Enzyme
Mol. Mass.:49669.03
Organism:Homo sapiens (Human)
Description:Catalytic domain of human cloned isozyme was used in the assay
Residue:459
BDBM50240179
NameBDBM50240179
Synonyms:CHEMBL1334282 | US9962398, Compound MST-141
TypeSmall organic molecule
Emp. Form.C13H12FN3O3S
Mol. Mass.309.316
SMILESNS(=O)(=O)c1ccc(NC(=O)Nc2ccccc2F)cc1