Reaction Details
TargetCarbonic anhydrase 12
LigandBDBM50240183
Substrate/Competitorn/a
Meas. Tech.ChEMBL_1667780 (CHEMBL4017668)
Ki 7.4±n/a nM
Citation Carta, FVullo, DOsman, SMAlOthman, ZSupuran, CT Synthesis and carbonic anhydrase inhibition of a series of SLC-0111 analogs. Bioorg Med Chem25:2569-2576 (2017) 
 
Carbonic anhydrase 12
Name:Carbonic anhydrase 12
Type:Enzyme
Mol. Mass.:39456.00
Organism:Homo sapiens (Human)
Description:Catalytic domain of human cloned isozyme was used in the assay
Residue:354
BDBM50240183
NameBDBM50240183
Synonyms:CHEMBL4080618 | US9962398, Compound MST-135
TypeSmall organic molecule
Emp. Form.C13H11BrFN3O3S
Mol. Mass.388.212
SMILESNS(=O)(=O)c1ccc(NC(=O)Nc2ccc(Br)cc2F)cc1