Reaction Details
TargetCarbonic anhydrase 12
LigandBDBM50240188
Substrate/Competitorn/a
Meas. Tech.ChEMBL_1667780 (CHEMBL4017668)
Ki 7.6±n/a nM
Citation Carta, FVullo, DOsman, SMAlOthman, ZSupuran, CT Synthesis and carbonic anhydrase inhibition of a series of SLC-0111 analogs. Bioorg Med Chem25:2569-2576 (2017) 
 
Carbonic anhydrase 12
Name:Carbonic anhydrase 12
Type:Enzyme
Mol. Mass.:39456.00
Organism:Homo sapiens (Human)
Description:Catalytic domain of human cloned isozyme was used in the assay
Residue:354
BDBM50240188
NameBDBM50240188
Synonyms:CHEMBL4098655 | US9962398, Compound MST-136
TypeSmall organic molecule
Emp. Form.C13H11FN4O5S
Mol. Mass.354.314
SMILESNS(=O)(=O)c1ccc(NC(=O)Nc2cc(ccc2F)[N+]([O-])=O)cc1