Reaction Details
TargetProtein kinase C theta type
LigandBDBM50240301
Substrate/Competitorn/a
Meas. Tech.ChEMBL_1668070 (CHEMBL4017958)
IC50 18±n/a nM
Citation Katoh, TTomata, YSetoh, MSasaki, STakai, TYoshitomi, YYukawa, TNakagawa, HFukumoto, STsukamoto, TNakada, Y Practical application of 3-substituted-2,6-difluoropyridines in drug discovery: Facile synthesis of novel protein kinase C theta inhibitors. Bioorg Med Chem Lett27:2497-2501 (2017) 
 
Protein kinase C theta type
Name:Protein kinase C theta type
Type:Serine/threonine-protein kinase
Mol. Mass.:81878.04
Organism:Homo sapiens (Human)
Description:Full-length human PKC theta (Panvera Catalog No. P2996).
Residue:706
BDBM50240301
NameBDBM50240301
Synonyms:CHEMBL4074629
TypeSmall organic molecule
Emp. Form.C16H17ClN6O
Mol. Mass.344.799
SMILESClc1ccc(nc1-n1c2cccnc2[nH]c1=O)N1CCCNCC1