Reaction Details
TargetPhosphatidylinositol 4,5-bisphosphate 3-kinase catalytic subunit gamma isoform
LigandBDBM50240324
Substrate/Competitorn/a
Meas. Tech.ChEMBL_1668121 (CHEMBL4018009)
Ki 67±n/a nM
Citation Martínez González, SRodríguez-Arístegui, SHernández, AIVarela, CGonzález Cantalapiedra, EÁlvarez, RMRodríguez Hergueta, ABischoff, JRAlbarrán, MICebriá, ACendón, ECebrián, DAlfonso, PPastor, J Generation of tricyclic imidazo[1,2-a]pyrazines as novel PI3K inhibitors by application of a conformational restriction strategy. Bioorg Med Chem Lett27:2536-2543 (2017) 
 
Phosphatidylinositol 4,5-bisphosphate 3-kinase catalytic subunit gamma isoform
Name:Phosphatidylinositol 4,5-bisphosphate 3-kinase catalytic subunit gamma isoform
Type:Enzyme Subunit
Mol. Mass.:126470.30
Organism:Homo sapiens (Human)
Description:P48736
Residue:1102
BDBM50240324
NameBDBM50240324
Synonyms:CHEMBL4067552
TypeSmall organic molecule
Emp. Form.C25H26FN9O2
Mol. Mass.503.5314
SMILESNc1ncc(cn1)-c1cn2c3CCN(Cc3nc2c(n1)N1CCOCC1)C(=O)NCc1ccc(F)cc1