Reaction Details
TargetMeprin A subunit beta
LigandBDBM13095
Substrate/Competitorn/a
Meas. Tech.ChEMBL_1668162 (CHEMBL4018050)
IC50 42900±n/a nM
Citation Ramsbeck, DHamann, ASchlenzig, DSchilling, SBuchholz, M First insight into structure-activity relationships of selective meprin? inhibitors. Bioorg Med Chem Lett27:2428-2431 (2017) 
 
Meprin A subunit beta
Name:Meprin A subunit beta
Type:PROTEIN
Mol. Mass.:79560.71
Organism:Homo sapiens
Description:ChEMBL_117484
Residue:701
BDBM13095
NameBDBM13095
Synonyms:CGS 27023A Analog 23 | N-hydroxy-2-[(4-methoxybenzene)(2-phenylethyl)sulfonamido]acetamide
TypeSmall organic molecule
Emp. Form.C17H20N2O5S
Mol. Mass.364.416
SMILESCOc1ccc(cc1)S(=O)(=O)N(CCc1ccccc1)CC(=O)NO