Reaction Details
TargetMuscarinic acetylcholine receptor M1
LigandBDBM50240543
Substrate/Competitorn/a
Meas. Tech.ChEMBL_1668374 (CHEMBL4018262)
IC50 540±n/a nM
Citation Bender, AMWeiner, RLLuscombe, VBCho, HPNiswender, CMEngers, DWBridges, TMConn, PJLindsley, CW Synthesis and evaluation of 4,6-disubstituted pyrimidines as CNS penetrant pan-muscarinic antagonists with a novel chemotype. Bioorg Med Chem Lett27:2479-2483 (2017) 
 
Muscarinic acetylcholine receptor M1
Name:Muscarinic acetylcholine receptor M1
Type:Protein
Mol. Mass.:51442.54
Organism:Homo sapiens (Human)
Description:P11229
Residue:460
BDBM50240543
NameBDBM50240543
Synonyms:CHEMBL4096589
TypeSmall organic molecule
Emp. Form.C24H22F2N4O2
Mol. Mass.436.4539
SMILESFc1ccc(Oc2cc(ncn2)N2CCC(CC2)C(=O)N2Cc3ccccc3C2)c(F)c1