Reaction Details
TargetMuscarinic acetylcholine receptor M4
LigandBDBM50240533
Substrate/Competitorn/a
Meas. Tech.ChEMBL_1668370 (CHEMBL4018258)
IC50 123±n/a nM
Citation Bender, AMWeiner, RLLuscombe, VBCho, HPNiswender, CMEngers, DWBridges, TMConn, PJLindsley, CW Synthesis and evaluation of 4,6-disubstituted pyrimidines as CNS penetrant pan-muscarinic antagonists with a novel chemotype. Bioorg Med Chem Lett27:2479-2483 (2017) 
 
Muscarinic acetylcholine receptor M4
Name:Muscarinic acetylcholine receptor M4
Type:Enzyme Catalytic Domain
Mol. Mass.:53079.31
Organism:Homo sapiens (Human)
Description:Cholinergic, muscarinic M4 CHRM4 HUMAN M3::P08173
Residue:479
BDBM50240533
NameBDBM50240533
Synonyms:CHEMBL4096143
TypeSmall organic molecule
Emp. Form.C25H25FN4O2
Mol. Mass.432.49
SMILESFc1ccccc1Oc1cc(ncn1)N1CCC(CC1)C(=O)N1CCc2ccccc2C1