Reaction Details
TargetMuscarinic acetylcholine receptor M3
LigandBDBM50240548
Substrate/Competitorn/a
Meas. Tech.ChEMBL_1668376 (CHEMBL4018264)
IC50 380±n/a nM
Citation Bender, AMWeiner, RLLuscombe, VBCho, HPNiswender, CMEngers, DWBridges, TMConn, PJLindsley, CW Synthesis and evaluation of 4,6-disubstituted pyrimidines as CNS penetrant pan-muscarinic antagonists with a novel chemotype. Bioorg Med Chem Lett27:2479-2483 (2017) 
 
Muscarinic acetylcholine receptor M3
Name:Muscarinic acetylcholine receptor M3
Type:Enzyme
Mol. Mass.:66151.03
Organism:Homo sapiens (Human)
Description:P20309
Residue:590
BDBM50240548
NameBDBM50240548
Synonyms:CHEMBL4059829
TypeSmall organic molecule
Emp. Form.C25H24F2N4O2
Mol. Mass.450.4805
SMILESFc1ccc(Oc2cc(ncn2)N2CCC(CC2)C(=O)N2CCc3ccccc3C2)c(F)c1