Reaction Details
TargetMuscarinic acetylcholine receptor M1
LigandBDBM50240533
Substrate/Competitorn/a
Meas. Tech.ChEMBL_1668374 (CHEMBL4018262)
IC50 322±n/a nM
Citation Bender, AMWeiner, RLLuscombe, VBCho, HPNiswender, CMEngers, DWBridges, TMConn, PJLindsley, CW Synthesis and evaluation of 4,6-disubstituted pyrimidines as CNS penetrant pan-muscarinic antagonists with a novel chemotype. Bioorg Med Chem Lett27:2479-2483 (2017) 
 
Muscarinic acetylcholine receptor M1
Name:Muscarinic acetylcholine receptor M1
Type:Protein
Mol. Mass.:51442.54
Organism:Homo sapiens (Human)
Description:P11229
Residue:460
BDBM50240533
NameBDBM50240533
Synonyms:CHEMBL4096143
TypeSmall organic molecule
Emp. Form.C25H25FN4O2
Mol. Mass.432.49
SMILESFc1ccccc1Oc1cc(ncn1)N1CCC(CC1)C(=O)N1CCc2ccccc2C1