Reaction Details
TargetGlucagon-like peptide 1 receptor
LigandBDBM50152769
Substrate/Competitorn/a
Meas. Tech.ChEMBL_1668942 (CHEMBL4018830)
EC50 0.044000±n/a nM
Citation Bech, EMMartos-Maldonado, MCWismann, PSørensen, KKvan Witteloostuijn, SBThygesen, MBVrang, NJelsing, JPedersen, SLJensen, KJ Peptide Half-Life Extension: Divalent, Small-Molecule Albumin Interactions Direct the Systemic Properties of Glucagon-Like Peptide 1 (GLP-1) Analogues. J Med Chem60:7434-7446 (2017) 
 
Glucagon-like peptide 1 receptor
Name:Glucagon-like peptide 1 receptor
Type:Enzyme
Mol. Mass.:53035.78
Organism:Homo sapiens (Human)
Description:P43220
Residue:463
BDBM50152769
NameBDBM50152769
Synonyms:CHEMBL410972 GLP-17-(7-36) derivative | NH2-HAEGTFTSDVSSYLEGQAAKEFIAWLVKGR-CONH2
TypeSmall organic molecule
Emp. Form.C149H226N40O45
Mol. Mass.3297.6297
SMILESCC[C@H](C)[C@H](NC(=O)[C@H](Cc1ccccc1)NC(=O)[C@H](CCC(O)=O)NC(=O)[C@H](CCCCN)NC(=O)[C@H](C)NC(=O)[C@H](C)NC(=O)[C@H](CCC(N)=O)NC(=O)CNC(=O)[C@H](CCC(O)=O)NC(=O)[C@H](CC(C)C)NC(=O)[C@H](Cc1ccc(O)cc1)NC(=O)[C@H](CO)NC(=O)[C@H](CO)NC(=O)[C@@H](NC(=O)[C@H](CC(O)=O)NC(=O)[C@H](CO)NC(=O)[C@@H](NC(=O)[C@H](Cc1ccccc1)NC(=O)[C@@H](NC(=O)CNC(=O)[C@H](CCC(O)=O)NC(=O)[C@H](C)NC(=O)[C@@H](N)Cc1cnc[nH]1)[C@@H](C)O)[C@@H](C)O)C(C)C)C(=O)N[C@@H](C)C(=O)N[C@@H](Cc1c[nH]c2ccccc12)C(=O)N[C@@H](CC(C)C)C(=O)N[C@@H](C(C)C)C(=O)N[C@@H](CCCCN)C(=O)NCC(=O)N[C@@H](CCCN=C(N)N)C(N)=O