Reaction Details
TargetGlucagon-like peptide 1 receptor
LigandBDBM50240822
Substrate/Competitorn/a
Meas. Tech.ChEMBL_1668942 (CHEMBL4018830)
EC50 0.547000±n/a nM
Citation Bech, EMMartos-Maldonado, MCWismann, PSørensen, KKvan Witteloostuijn, SBThygesen, MBVrang, NJelsing, JPedersen, SLJensen, KJ Peptide Half-Life Extension: Divalent, Small-Molecule Albumin Interactions Direct the Systemic Properties of Glucagon-Like Peptide 1 (GLP-1) Analogues. J Med Chem60:7434-7446 (2017) 
 
Glucagon-like peptide 1 receptor
Name:Glucagon-like peptide 1 receptor
Type:Enzyme
Mol. Mass.:53035.78
Organism:Homo sapiens (Human)
Description:P43220
Residue:463
BDBM50240822
NameBDBM50240822
Synonyms:CHEMBL4079706
TypeSmall organic molecule
Emp. Form.C195H267ClF2N46O58
Mol. Mass.4256.93
SMILESCC[C@H](C)[C@H](NC(=O)[C@H](Cc1ccccc1)NC(=O)[C@H](CCC(O)=O)NC(=O)[C@H](CCCCNC(=O)[C@H](CCCNC(=O)COc1ccc(cc1C(O)=O)-c1ccc(F)cc1F)NC(=O)CC[C@H](NC(=O)Cc1c(C)n(C(=O)c2ccc(Cl)cc2)c2ccc(OC)cc12)C(O)=O)NC(=O)[C@H](C)NC(=O)[C@H](C)NC(=O)[C@H](CCC(N)=O)NC(=O)CNC(=O)[C@H](CCC(O)=O)NC(=O)[C@H](CC(C)C)NC(=O)[C@H](Cc1ccc(O)cc1)NC(=O)[C@H](CO)NC(=O)[C@H](CO)NC(=O)[C@@H](NC(=O)[C@H](CC(O)=O)NC(=O)[C@H](CO)NC(=O)[C@@H](NC(=O)[C@H](Cc1ccccc1)NC(=O)[C@@H](NC(=O)CNC(=O)[C@H](CCC(O)=O)NC(=O)[C@H](C)NC(=O)[C@@H](N)Cc1cnc[nH]1)[C@@H](C)O)[C@@H](C)O)C(C)C)C(=O)N[C@@H](C)C(=O)N[C@@H](Cc1c[nH]c2ccccc12)C(=O)N[C@@H](CC(C)C)C(=O)N[C@@H](C(C)C)C(=O)N[C@@H](CCCNC(N)=N)C(=O)NCC(=O)N[C@@H](CCCNC(N)=N)C(=O)NCC(O)=O