Reaction Details
TargetSerine/threonine-protein kinase PLK1
LigandBDBM25121
Substrate/Competitorn/a
Meas. Tech.ChEMBL_1668973 (CHEMBL4018861)
IC50 0.830000±n/a nM
Citation Zhu, JYCuellar, RABerndt, NLee, HEOlesen, SHMartin, MPJensen, JTGeorg, GISchönbrunn, E Structural Basis of Wee Kinases Functionality and Inactivation by Diverse Small Molecule Inhibitors. J Med Chem60:7863-7875 (2017) 
 
Serine/threonine-protein kinase PLK1
Name:Serine/threonine-protein kinase PLK1
Type:Serine/threonine-protein kinase
Mol. Mass.:68277.16
Organism:Homo sapiens (Human)
Description:P53350
Residue:603
BDBM25121
NameBDBM25121
Synonyms:4-{[(7R)-8-cyclopentyl-7-ethyl-5-methyl-6-oxo-5,6,7,8-tetrahydropteridin-2-yl]amino}-3-methoxy-N-(1-methylpiperidin-4-yl)benzamide CHEMBL513909 US8598172, 5
TypeSmall organic molecule
Emp. Form.C28H39N7O3
Mol. Mass.521.6544
SMILESCC[C@H]1N(C2CCCC2)c2nc(Nc3ccc(cc3OC)C(=O)NC3CCN(C)CC3)ncc2N(C)C1=O