Reaction Details
TargetWee1-like protein kinase 2
LigandBDBM3096
Substrate/Competitorn/a
Meas. Tech.ChEMBL_1668980 (CHEMBL4018868)
Kd 5.0±n/a nM
Citation Zhu, JYCuellar, RABerndt, NLee, HEOlesen, SHMartin, MPJensen, JTGeorg, GISchönbrunn, E Structural Basis of Wee Kinases Functionality and Inactivation by Diverse Small Molecule Inhibitors. J Med Chem60:7863-7875 (2017) 
 
Wee1-like protein kinase 2
Name:Wee1-like protein kinase 2
Type:PROTEIN
Mol. Mass.:62923.50
Organism:Homo sapiens (Human)
Description:ChEMBL_774226
Residue:567
BDBM3096
NameBDBM3096
Synonyms:2-aminopyrido[2,3-d]pyrimidin-7(8H)-one deriv. 6-(2,6-dichlorophenyl)-2-({4-[2-(diethylamino)ethoxy]phenyl}amino)-8-methyl-7H,8H-pyrido[2,3-d]pyrimidin-7-one D3RKN_84 | PD166285
TypeSmall organic molecule
Emp. Form.C26H27Cl2N5O2
Mol. Mass.512.431
SMILESCCN(CC)CCOc1ccc(Nc2ncc3cc(-c4c(Cl)cccc4Cl)c(=O)n(C)c3n2)cc1