Reaction Details
TargetMembrane-associated tyrosine- and threonine-specific cdc2-inhibitory kinase
LigandBDBM50240828
Substrate/Competitorn/a
Meas. Tech.ChEMBL_1668981 (CHEMBL4018869)
Kd 444±n/a nM
Citation Zhu, JYCuellar, RABerndt, NLee, HEOlesen, SHMartin, MPJensen, JTGeorg, GISchönbrunn, E Structural Basis of Wee Kinases Functionality and Inactivation by Diverse Small Molecule Inhibitors. J Med Chem60:7863-7875 (2017) 
 
Membrane-associated tyrosine- and threonine-specific cdc2-inhibitory kinase
Name:Membrane-associated tyrosine- and threonine-specific cdc2-inhibitory kinase
Type:PROTEIN
Mol. Mass.:54523.76
Organism:Homo sapiens (Human)
Description:ChEMBL_587209
Residue:499
BDBM50240828
NameBDBM50240828
Synonyms:CHEMBL4067978
TypeSmall organic molecule
Emp. Form.C26H29Cl2N5O3
Mol. Mass.530.446
SMILESCOc1cc2c(Nc3cc(Cl)c(OC)c(Cl)c3)c(cnc2cc1OCCCN1CCN(C)CC1)C#N