Reaction Details
TargetWee1-like protein kinase
LigandBDBM50240826
Substrate/Competitorn/a
Meas. Tech.ChEMBL_1668962 (CHEMBL4018850)
Kd 3.2±n/a nM
Citation Zhu, JYCuellar, RABerndt, NLee, HEOlesen, SHMartin, MPJensen, JTGeorg, GISchönbrunn, E Structural Basis of Wee Kinases Functionality and Inactivation by Diverse Small Molecule Inhibitors. J Med Chem60:7863-7875 (2017) 
 
Wee1-like protein kinase
Name:Wee1-like protein kinase
Type:PROTEIN
Mol. Mass.:71599.12
Organism:Homo sapiens (Human)
Description:ChEMBL_1445054
Residue:646
BDBM50240826
NameBDBM50240826
Synonyms:AZD-1775 US11124518, Example AZD1775 US11479555, Example AZD1775
TypeSmall organic molecule
Emp. Form.C27H32N8O2
Mol. Mass.500.5954
SMILESCN1CCN(CC1)c1ccc(Nc2ncc3c(n2)n(-c2cccc(n2)C(C)(C)O)n(CC=C)c3=O)cc1