Reaction Details
TargetNeuropeptide Y receptor type 4
LigandBDBM50240829
Substrate/Competitorn/a
Meas. Tech.ChEMBL_1669008 (CHEMBL4018896)
Ki 6.3±n/a nM
Citation Schubert, MStichel, JDu, YTough, IRSliwoski, GMeiler, JCox, HMWeaver, CDBeck-Sickinger, AG Identification and Characterization of the First Selective Y J Med Chem60:7605-7612 (2017) 
 
Neuropeptide Y receptor type 4
Name:Neuropeptide Y receptor type 4
Type:Enzyme Catalytic Domain
Mol. Mass.:42207.58
Organism:Homo sapiens (Human)
Description:NPY-Y4 PPYR1 HUMAN::P50391
Residue:375
BDBM50240829
NameBDBM50240829
Synonyms:CHEMBL3559801
TypeSmall organic molecule
Emp. Form.C16H24O2
Mol. Mass.248.3606
SMILESCC(C)(C)c1ccc(OC2CCCCC2O)cc1