Reaction Details
TargetAdenosine receptor A3
LigandBDBM50240836
Substrate/Competitorn/a
Meas. Tech.ChEMBL_1669078 (CHEMBL4018966)
Ki 1.3±n/a nM
Citation Xia, LBurger, WACvan Veldhoven, JPDKuiper, BJvan Duijl, TTLenselink, EBPaasman, EHeitman, LHIJzerman, AP Structure-Affinity Relationships and Structure-Kinetics Relationships of Pyrido[2,1-f]purine-2,4-dione Derivatives as Human Adenosine A J Med Chem60:7555-7568 (2017) 
 
Adenosine receptor A3
Name:Adenosine receptor A3
Type:G Protein-Coupled Receptor (GPCR)
Mol. Mass.:36197.32
Organism:Homo sapiens (Human)
Description:P0DMS8
Residue:318
BDBM50240836
NameBDBM50240836
Synonyms:CHEMBL4059466
TypeSmall organic molecule
Emp. Form.C21H19BrN4O3
Mol. Mass.455.305
SMILESCOc1ccn2c(c1)nc1n(Cc3ccc(Br)cc3)c(=O)n(CC3CC3)c(=O)c21