Reaction Details
TargetAdenosine receptor A3
LigandBDBM50240861
Substrate/Competitorn/a
Meas. Tech.ChEMBL_1669078 (CHEMBL4018966)
Ki 1.5±n/a nM
Citation Xia, LBurger, WACvan Veldhoven, JPDKuiper, BJvan Duijl, TTLenselink, EBPaasman, EHeitman, LHIJzerman, AP Structure-Affinity Relationships and Structure-Kinetics Relationships of Pyrido[2,1-f]purine-2,4-dione Derivatives as Human Adenosine A J Med Chem60:7555-7568 (2017) 
 
Adenosine receptor A3
Name:Adenosine receptor A3
Type:G Protein-Coupled Receptor (GPCR)
Mol. Mass.:36197.32
Organism:Homo sapiens (Human)
Description:P0DMS8
Residue:318
BDBM50240861
NameBDBM50240861
Synonyms:CHEMBL4084043
TypeSmall organic molecule
Emp. Form.C21H22N4O3
Mol. Mass.378.4244
SMILESCCCCn1c(=O)n(Cc2ccccc2)c2nc3cc(OC)ccn3c2c1=O