Reaction Details
TargetProtein-glutamine gamma-glutamyltransferase 2
LigandBDBM50241240
Substrate/Competitorn/a
Meas. Tech.ChEMBL_1669694 (CHEMBL4019582)
Ki 52100±n/a nM
Citation Akbar, AMcNeil, NMRAlbert, MRTa, VAdhikary, GBourgeois, KEckert, RLKeillor, JW Structure-Activity Relationships of Potent, Targeted Covalent Inhibitors That Abolish Both the Transamidation and GTP Binding Activities of Human Tissue Transglutaminase. J Med Chem60:7910-7927 (2017) 
 
Protein-glutamine gamma-glutamyltransferase 2
Name:Protein-glutamine gamma-glutamyltransferase 2
Type:Protein
Mol. Mass.:77309.30
Organism:Homo sapiens (Human)
Description:P21980
Residue:687
BDBM50241240
NameBDBM50241240
Synonyms:CHEMBL4078058
TypeSmall organic molecule
Emp. Form.C23H32N4O5
Mol. Mass.444.524
SMILESCC(=O)N1CCN(CC1)C(=O)[C@H](CCCCNC(=O)C=C)NC(=O)OCc1ccccc1