Reaction Details
TargetProtein-glutamine gamma-glutamyltransferase 2
LigandBDBM50241241
Substrate/Competitorn/a
Meas. Tech.ChEMBL_1669702 (CHEMBL4019590)
Ki 27100±n/a nM
Citation Akbar, AMcNeil, NMRAlbert, MRTa, VAdhikary, GBourgeois, KEckert, RLKeillor, JW Structure-Activity Relationships of Potent, Targeted Covalent Inhibitors That Abolish Both the Transamidation and GTP Binding Activities of Human Tissue Transglutaminase. J Med Chem60:7910-7927 (2017) 
 
Protein-glutamine gamma-glutamyltransferase 2
Name:Protein-glutamine gamma-glutamyltransferase 2
Type:Protein
Mol. Mass.:77309.30
Organism:Homo sapiens (Human)
Description:P21980
Residue:687
BDBM50241241
NameBDBM50241241
Synonyms:CHEMBL4102452
TypeSmall organic molecule
Emp. Form.C33H43N5O6S
Mol. Mass.637.789
SMILESCN(C)c1cccc2c(cccc12)S(=O)(=O)NCCCCNC(=O)[C@H](CCCCNC(=O)C=C)NC(=O)OCc1ccccc1