Reaction Details
TargetD(2) dopamine receptor
LigandBDBM50002000
Substrate/Competitorn/a
Meas. Tech.ChEBML_61411
IC50 2.2±n/a nM
Citation Perregaard, JArnt, JBøgesø, KPHyttel, JSánchez, C Noncataleptogenic, centrally acting dopamine D-2 and serotonin 5-HT2 antagonists within a series of 3-substituted 1-(4-fluorophenyl)-1H-indoles. J Med Chem35:1092-101 (1992) D(2) dopamine receptor
Name:D(2) dopamine receptor
Type:G Protein-Coupled Receptor (GPCR)
Mol. Mass.:50931.60
Organism:Rattus norvegicus (rat)
Description:P61169
Residue:444
BDBM50002000
NameBDBM50002000
Synonyms:1-(4-Fluoro-phenyl)-3-{1-[2-(2-oxo-imidazolidin-1-yl)-ethyl]-piperidin-4-yl}-1H-indole-5-carbonitrile | CHEMBL12453
TypeSmall organic molecule
Emp. Form.C25H26FN5O
Mol. Mass.431.5052
SMILESFc1ccc(cc1)-n1cc(C2CCN(CCN3CCNC3=O)CC2)c2cc(ccc12)C#N