Reaction Details
TargetTransient receptor potential cation channel subfamily V member 1
LigandBDBM20458
Substrate/Competitorn/a
Meas. Tech.ChEMBL_1669895 (CHEMBL4019783)
Kd 3.4±n/a nM
Citation Pearce, LVAnn, JJung, AThorat, SAHerold, BKAHabtemichael, ADBlumberg, PMLee, J Novel Radiolabeled Vanilloid with Enhanced Specificity for Human Transient Receptor Potential Vanilloid 1 (TRPV1). J Med Chem60:8246-8252 (2017) 
 
Transient receptor potential cation channel subfamily V member 1
Name:Transient receptor potential cation channel subfamily V member 1
Type:Protein
Mol. Mass.:94960.75
Organism:Homo sapiens (Human)
Description:Q8NER1
Residue:839
BDBM20458
NameBDBM20458
Synonyms:1-[(1R)-5-tert-butyl-2,3-dihydro-1H-inden-1-yl]-3-isoquinolin-5-ylurea A-778317 [3H] A-778317
TypeSmall organic molecule
Emp. Form.C23H25N3O
Mol. Mass.359.4641
SMILESCC(C)(C)c1ccc2[C@@H](CCc2c1)NC(=O)Nc1cccc2cnccc12