Reaction Details
TargetPolycomb protein EED
LigandBDBM223984
Substrate/Competitorn/a
Meas. Tech.ChEMBL_1670154 (CHEMBL4020042)
Kd 38000±n/a nM
Citation Wang, YEdalji, RPPanchal, SCSun, CDjuric, SWVasudevan, A Are We There Yet? Applying Thermodynamic and Kinetic Profiling on Embryonic Ectoderm Development (EED) Hit-to-Lead Program. J Med Chem60:8321-8335 (2017) 
 
Polycomb protein EED
Name:Polycomb protein EED
Type:Protein
Mol. Mass.:50201.68
Organism:Homo sapiens (Human)
Description:O75530
Residue:441
BDBM223984
NameBDBM223984
Synonyms:rac-(3R,4S)-1-(2-methoxybenzyl)-N,N-dimethyl-4-(1-methyl-1H-indol-3-yl)pyrrolidin-3-amine (1)
TypeSmall organic molecule
Emp. Form.C23H29N3O
Mol. Mass.363.4959
SMILESCOc1ccccc1CN1C[C@@H]([C@H](C1)c1cn(C)c2ccccc12)N(C)C