Reaction Details
TargetPolycomb protein EED
LigandBDBM50241656
Substrate/Competitorn/a
Meas. Tech.ChEMBL_1670151 (CHEMBL4020039)
Ki 42±n/a nM
Citation Wang, YEdalji, RPPanchal, SCSun, CDjuric, SWVasudevan, A Are We There Yet? Applying Thermodynamic and Kinetic Profiling on Embryonic Ectoderm Development (EED) Hit-to-Lead Program. J Med Chem60:8321-8335 (2017) 
 
Polycomb protein EED
Name:Polycomb protein EED
Type:Protein
Mol. Mass.:50201.68
Organism:Homo sapiens (Human)
Description:O75530
Residue:441
BDBM50241656
NameBDBM50241656
Synonyms:CHEMBL4092154
TypeSmall organic molecule
Emp. Form.C27H35FN4O
Mol. Mass.450.5914
SMILESCN(C)[C@@H]1CN(C[C@H]1c1ccc(cc1)N1CCN(CC1)C(C)=O)[C@H]1CCc2cccc(F)c12