Reaction Details
TargetPolycomb protein EED
LigandBDBM50241650
Substrate/Competitorn/a
Meas. Tech.ChEMBL_1670151 (CHEMBL4020039)
Ki 8.0±n/a nM
Citation Wang, YEdalji, RPPanchal, SCSun, CDjuric, SWVasudevan, A Are We There Yet? Applying Thermodynamic and Kinetic Profiling on Embryonic Ectoderm Development (EED) Hit-to-Lead Program. J Med Chem60:8321-8335 (2017) 
 
Polycomb protein EED
Name:Polycomb protein EED
Type:Protein
Mol. Mass.:50201.68
Organism:Homo sapiens (Human)
Description:O75530
Residue:441
BDBM50241650
NameBDBM50241650
Synonyms:CHEMBL4100850
TypeSmall organic molecule
Emp. Form.C22H25BrFN3O
Mol. Mass.446.356
SMILESCN(C)[C@H]1CN(Cc2c(F)cc(O)cc2Br)C[C@@H]1c1cn(C)c2ccccc12