Reaction Details
TargetPolycomb protein EED
LigandBDBM50235626
Substrate/Competitorn/a
Meas. Tech.ChEMBL_1670155 (CHEMBL4020043)
Kd 90±n/a nM
Citation Wang, YEdalji, RPPanchal, SCSun, CDjuric, SWVasudevan, A Are We There Yet? Applying Thermodynamic and Kinetic Profiling on Embryonic Ectoderm Development (EED) Hit-to-Lead Program. J Med Chem60:8321-8335 (2017) 
 
Polycomb protein EED
Name:Polycomb protein EED
Type:Protein
Mol. Mass.:50201.68
Organism:Homo sapiens (Human)
Description:O75530
Residue:441
BDBM50235626
NameBDBM50235626
Synonyms:CHEMBL4075197
TypeSmall organic molecule
Emp. Form.C22H25BrFN3
Mol. Mass.430.356
SMILESCN(C)[C@H]1CN(Cc2c(F)cccc2Br)C[C@@H]1c1cn(C)c2ccccc12