Reaction Details
TargetTyrosine-protein kinase Tec
LigandBDBM50241719
Substrate/Competitorn/a
Meas. Tech.ChEMBL_1670320 (CHEMBL4020208)
IC50 306±n/a nM
Citation Wang, YSun, YCao, RLiu, DXie, YLi, LQi, XHuang, N In Silico Identification of a Novel Hinge-Binding Scaffold for Kinase Inhibitor Discovery. J Med Chem60:8552-8564 (2017) 
 
Tyrosine-protein kinase Tec
Name:Tyrosine-protein kinase Tec
Type:Protein
Mol. Mass.:73597.00
Organism:Homo sapiens (Human)
Description:n/a
Residue:631
BDBM50241719
NameBDBM50241719
Synonyms:CHEMBL4101977
TypeSmall organic molecule
Emp. Form.C18H15ClFN5O
Mol. Mass.371.796
SMILESFc1cccc(Cl)c1CNc1nc(n[nH]1)-c1cccc(NC(=O)C=C)c1