Reaction Details
TargetD(2) dopamine receptor
LigandBDBM50002163
Substrate/Competitorn/a
Meas. Tech.ChEMBL_62422 (CHEMBL674826)
Ki 81±n/a nM
Citation Böttcher, HBarnickel, GHausberg, HHHaase, AFSeyfried, CAEiermann, V Synthesis and dopaminergic activity of some 3-(1,2,3,6-tetrahydro-1-pyridylalkyl)indoles. A novel conformational model to explain structure-activity relationships. J Med Chem35:4020-6 (1992) D(2) dopamine receptor
Name:D(2) dopamine receptor
Type:G Protein-Coupled Receptor (GPCR)
Mol. Mass.:50931.60
Organism:Rattus norvegicus (rat)
Description:P61169
Residue:444
BDBM50002163
NameBDBM50002163
Synonyms:3-[2-(4-Phenyl-3,6-dihydro-2H-pyridin-1-yl)-ethyl]-1H-indole | CHEMBL127609
TypeSmall organic molecule
Emp. Form.C21H22N2
Mol. Mass.302.4128
SMILESC(Cc1c[nH]c2ccccc12)N1CCC(=CC1)c1ccccc1