Reaction Details
TargetD(2) dopamine receptor
LigandBDBM50002165
Substrate/Competitorn/a
Meas. Tech.ChEMBL_62422 (CHEMBL674826)
Ki 21±n/a nM
Citation Böttcher, HBarnickel, GHausberg, HHHaase, AFSeyfried, CAEiermann, V Synthesis and dopaminergic activity of some 3-(1,2,3,6-tetrahydro-1-pyridylalkyl)indoles. A novel conformational model to explain structure-activity relationships. J Med Chem35:4020-6 (1992) D(2) dopamine receptor
Name:D(2) dopamine receptor
Type:G Protein-Coupled Receptor (GPCR)
Mol. Mass.:50931.60
Organism:Rattus norvegicus (rat)
Description:P61169
Residue:444
BDBM50002165
NameBDBM50002165
Synonyms:3-{4-[4-(2-Chloro-phenyl)-3,6-dihydro-2H-pyridin-1-yl]-butyl}-1H-indole | CHEMBL131711
TypeSmall organic molecule
Emp. Form.C23H25ClN2
Mol. Mass.364.911
SMILESClc1ccccc1C1=CCN(CCCCc2c[nH]c3ccccc23)CC1