Reaction Details
TargetD(2) dopamine receptor
LigandBDBM50002162
Substrate/Competitorn/a
Meas. Tech.ChEMBL_62422 (CHEMBL674826)
Ki 5.4±n/a nM
Citation Böttcher, HBarnickel, GHausberg, HHHaase, AFSeyfried, CAEiermann, V Synthesis and dopaminergic activity of some 3-(1,2,3,6-tetrahydro-1-pyridylalkyl)indoles. A novel conformational model to explain structure-activity relationships. J Med Chem35:4020-6 (1992) D(2) dopamine receptor
Name:D(2) dopamine receptor
Type:G Protein-Coupled Receptor (GPCR)
Mol. Mass.:50931.60
Organism:Rattus norvegicus (rat)
Description:P61169
Residue:444
BDBM50002162
NameBDBM50002162
Synonyms:2-Methyl-3-[4-(4-phenyl-3,6-dihydro-2H-pyridin-1-yl)-butyl]-1H-indole | CHEMBL338849
TypeSmall organic molecule
Emp. Form.C24H28N2
Mol. Mass.344.4925
SMILESCc1[nH]c2ccccc2c1CCCCN1CCC(=CC1)c1ccccc1