Reaction Details
TargetCyclin-C/Cyclin-dependent kinase 19
LigandBDBM50241868
Substrate/Competitorn/a
Meas. Tech.ChEMBL_1670927 (CHEMBL4020956)
IC50 7.6±n/a nM
Citation Fujimoto, JHirayama, THirata, YHikichi, YMurai, SHasegawa, MHasegawa, YYonemori, KHata, AAoyama, KCary, DR Studies of CDK 8/19 inhibitors: Discovery of novel and selective CDK8/19 dual inhibitors and elimination of their CYP3A4 time-dependent inhibition potential. Bioorg Med Chem25:3018-3033 (2017) 
 
Cyclin-C/Cyclin-dependent kinase 19
Name:Cyclin-C/Cyclin-dependent kinase 19
Synonyms:CDK19/Cyclin C
Type:Protein
Mol. Mass.:n/a
Description:n/a
Components:This complex has 2 components.
Component 1
Name:Cyclin-dependent kinase 19
Type:Serine/Threonine protein kinase
Mol. Mass.:56816.68
Organism:Homo sapiens (Human)
Description:Q9BWU1
Residue:502
Component 2
Name:Cyclin-C
Synonyms:CCNC Cyclin C hSRB11
Type:PROTEIN
Mol. Mass.:33244.88
Organism:Homo sapiens (Human)
Description:ChEMBL_107900
Residue:283
BDBM50241868
NameBDBM50241868
Synonyms:CHEMBL4092865
TypeSmall organic molecule
Emp. Form.C25H27N5O2
Mol. Mass.429.5142
SMILESO=C(Nc1ccc(CN2CCOCC2)cc1)\C=C\c1cnccc1-c1cnn(c1)C1CC1