Reaction Details
TargetSigma non-opioid intracellular receptor 1
LigandBDBM50170654
Substrate/Competitorn/a
Meas. Tech.ChEMBL_1672043 (CHEMBL4022072)
Ki 0.005000±n/a nM
Citation Sguazzini, ESchmidt, HRIyer, KAKruse, ACDukat, M Reevaluation of fenpropimorph as a? receptor ligand: Structure-affinity relationship studies at human? Bioorg Med Chem Lett27:2912-2919 (2017) 
 
Sigma non-opioid intracellular receptor 1
Name:Sigma non-opioid intracellular receptor 1
Type:Protein
Mol. Mass.:25307.17
Organism:Cavia porcellus (Guinea pig)
Description:Q60492
Residue:223
BDBM50170654
NameBDBM50170654
Synonyms:(+-)-cis-4-(3-(4-tert-butylphenyl)-2-methylpropyl)-2,6-dimethylmorpholine CHEMBL372700 cis-4-(3-(4-(1,1-dimethylethyl)phenyl)-2-methylpropyl)-2,6-dimethylmorpholine cis-fenpropimorph fenpropimorph cis-form | fenpropimorphe
TypeSmall organic molecule
Emp. Form.C20H33NO
Mol. Mass.303.4821
SMILESCC(CN1C[C@H](C)O[C@H](C)C1)Cc1ccc(cc1)C(C)(C)C