Reaction Details
TargetMu-type opioid receptor
LigandBDBM50088381
Substrate/Competitorn/a
Meas. Tech.ChEMBL_1672055 (CHEMBL4022084)
Ki 0.316228±n/a nM
Citation Jiang, LBeattie, DTJacobsen, JRKintz, SObedencio, GPSaito, DStergiades, IVickery, RGLong, DD Discovery of N-substituted-endo-3-(8-aza-bicyclo[3.2.1]oct-3-yl)-phenol and -phenyl carboxamide series of?-opioid receptor antagonists. Bioorg Med Chem Lett27:2926-2930 (2017) 
 
Mu-type opioid receptor
Name:Mu-type opioid receptor
Type:G Protein-Coupled Receptor (GPCR)
Mol. Mass.:44789.51
Organism:Homo sapiens (Human)
Description:P35372
Residue:400
BDBM50088381
NameBDBM50088381
Synonyms:ADL 8-2698 Entereg
TypeSmall organic molecule
Emp. Form.C25H32N2O4
Mol. Mass.424.5326
SMILESC[C@H]1CN(C[C@H](Cc2ccccc2)C(=O)NCC(O)=O)CC[C@@]1(C)c1cccc(O)c1