Reaction Details
TargetKappa-type opioid receptor
LigandBDBM50242677
Substrate/Competitorn/a
Meas. Tech.ChEMBL_1672057 (CHEMBL4022086)
Ki 0.794328±n/a nM
Citation Jiang, LBeattie, DTJacobsen, JRKintz, SObedencio, GPSaito, DStergiades, IVickery, RGLong, DD Discovery of N-substituted-endo-3-(8-aza-bicyclo[3.2.1]oct-3-yl)-phenol and -phenyl carboxamide series of?-opioid receptor antagonists. Bioorg Med Chem Lett27:2926-2930 (2017) 
 
Kappa-type opioid receptor
Name:Kappa-type opioid receptor
Type:G Protein-Coupled Receptor (GPCR)
Mol. Mass.:42744.99
Organism:Cavia porcellus (domestic guinea pig)
Description:P41144
Residue:380
BDBM50242677
NameBDBM50242677
Synonyms:CHEMBL4088609
TypeSmall organic molecule
Emp. Form.C25H28N2O3
Mol. Mass.404.5014
SMILES[H][C@@]12CC[C@]([H])(C[C@H](C1)c1cccc(O)c1)N2CCCCN1C(=O)c2ccccc2C1=O