Reaction Details
TargetPolyunsaturated fatty acid 5-lipoxygenase
LigandBDBM50003408
Substrate/Competitorn/a
Meas. Tech.ChEBML_3958
IC50 550±n/a nM
Citation Wright, SWHarris, RRKerr, JSGreen, AMPinto, DJBruin, EMCollins, RJDorow, RLMantegna, LRSherk, SR Synthesis, chemical, and biological properties of vinylogous hydroxamic acids: dual inhibitors of 5-lipoxygenase and IL-1 biosynthesis. J Med Chem35:4061-8 (1992) Polyunsaturated fatty acid 5-lipoxygenase
Name:Polyunsaturated fatty acid 5-lipoxygenase
Type:PROTEIN
Mol. Mass.:78082.31
Organism:Rattus norvegicus
Description:ChEMBL_1432947
Residue:673
BDBM50003408
NameBDBM50003408
Synonyms:1-(4-Chloro-phenyl)-3-(hydroxy-methyl-amino)-propenone | CHEMBL131339
TypeSmall organic molecule
Emp. Form.C10H10ClNO2
Mol. Mass.211.645
SMILESCN(O)\C=C/C(=O)c1ccc(Cl)cc1