Reaction Details
TargetPolyunsaturated fatty acid 5-lipoxygenase
LigandBDBM50003447
Substrate/Competitorn/a
Meas. Tech.ChEBML_3958
IC50 270±n/a nM
Citation Wright, SWHarris, RRKerr, JSGreen, AMPinto, DJBruin, EMCollins, RJDorow, RLMantegna, LRSherk, SR Synthesis, chemical, and biological properties of vinylogous hydroxamic acids: dual inhibitors of 5-lipoxygenase and IL-1 biosynthesis. J Med Chem35:4061-8 (1992) Polyunsaturated fatty acid 5-lipoxygenase
Name:Polyunsaturated fatty acid 5-lipoxygenase
Type:PROTEIN
Mol. Mass.:78082.31
Organism:Rattus norvegicus
Description:ChEMBL_1432947
Residue:673
BDBM50003447
NameBDBM50003447
Synonyms:(Z)-3-(Cyclohexyl-hydroxy-amino)-1-(4-fluoro-phenyl)-propenone CHEMBL274373
TypeSmall organic molecule
Emp. Form.C15H18FNO2
Mol. Mass.263.3073
SMILESON(\C=C/C(=O)c1ccc(F)cc1)C1CCCCC1