Reaction Details
TargetAP2-associated protein kinase 1
LigandBDBM311218
Substrate/Competitorn/a
Meas. Tech.ChEMBL_1672603 (CHEMBL4022632)
IC50 0.070000±n/a nM
Citation Abdel-Magid, AF Inhibitors of Adaptor-Associated Kinase 1 (AAK1) May Treat Neuropathic Pain, Schizophrenia, Parkinson's Disease, and Other Disorders. ACS Med Chem Lett8:595-597 (2017) 
 
AP2-associated protein kinase 1
Name:AP2-associated protein kinase 1
Type:PROTEIN
Mol. Mass.:103884.23
Organism:Homo sapiens (Human)
Description:ChEMBL_774569
Residue:961
BDBM311218
NameBDBM311218
Synonyms:(S)-1-(2-cyclopropyl-4-(quinolin-4-yl)phenoxy)-2,4-dimethylpentan-2-amine US10351563, Example 74 US10981910, Example 74 | US9902722, Example 74
TypeSmall organic molecule
Emp. Form.C25H30N2O
Mol. Mass.374.5185
SMILESCC(C)C[C@](C)(N)COc1ccc(cc1C1CC1)-c1ccnc2ccccc12