Reaction Details
TargetCannabinoid receptor 1
LigandBDBM50243593
Substrate/Competitorn/a
Meas. Tech.ChEMBL_1672805 (CHEMBL4022834)
IC50 1.3±n/a nM
Citation Xia, Lde Vries, HLenselink, EBLouvel, JWaring, MJCheng, LPahlén, SPetersson, MJSchell, POlsson, RIHeitman, LHSheppard, RJIJzerman, AP Structure-Affinity Relationships and Structure-Kinetic Relationships of 1,2-Diarylimidazol-4-carboxamide Derivatives as Human Cannabinoid 1 Receptor Antagonists. J Med Chem60:9545-9564 (2017) 
 
Cannabinoid receptor 1
Name:Cannabinoid receptor 1
Type:G Protein-Coupled Receptor (GPCR)
Mol. Mass.:52868.96
Organism:Homo sapiens (Human)
Description:P21554
Residue:472
BDBM50243593
NameBDBM50243593
Synonyms:CHEMBL4089947
TypeSmall organic molecule
Emp. Form.C27H32Cl2N4O4S
Mol. Mass.579.538
SMILESCC(C)CCS(=O)(=O)Oc1ccc(cc1)-n1c(C)c(nc1-c1ccc(Cl)cc1Cl)C(=O)NN1CCCCC1