Reaction Details
TargetLysosomal alpha-glucosidase
LigandBDBM18355
Substrate/Competitorn/a
Meas. Tech.ChEMBL_1672837 (CHEMBL4022866)
IC50 5300±n/a nM
Citation D'Alonzo, DDe Fenza, MPorto, CIacono, RHuebecker, MCobucci-Ponzano, BPriestman, DAPlatt, FParenti, GMoracci, MPalumbo, GGuaragna, A N-Butyl-l-deoxynojirimycin (l-NBDNJ): Synthesis of an Allosteric Enhancer of?-Glucosidase Activity for the Treatment of Pompe Disease. J Med Chem60:9462-9469 (2017) 
 
Lysosomal alpha-glucosidase
Name:Lysosomal alpha-glucosidase
Type:PROTEIN
Mol. Mass.:106191.24
Organism:Rattus norvegicus
Description:ChEMBL_1506157
Residue:953
BDBM18355
NameBDBM18355
Synonyms:(2R,3R,4R,5S)-1-butyl-2-(hydroxymethyl)piperidine-3,4,5-triol MIGLUSTAT US20230339856, Compound NB-DNJ | US9181184, 5
TypeSmall organic molecule
Emp. Form.C10H21NO4
Mol. Mass.219.278
SMILESCCCCN1C[C@H](O)[C@@H](O)[C@H](O)[C@H]1CO