Reaction Details
TargetSigma non-opioid intracellular receptor 1
LigandBDBM21398
Substrate/Competitorn/a
Meas. Tech.ChEMBL_1672838 (CHEMBL4022867)
Ki 2.5±n/a nM
Citation Amata, EDichiara, MArena, EPittalą, VPistarą, VCardile, VGraziano, ACEFraix, AMarrazzo, ASortino, SPrezzavento, O Novel Sigma Receptor Ligand-Nitric Oxide Photodonors: Molecular Hybrids for Double-Targeted Antiproliferative Effect. J Med Chem60:9531-9544 (2017) 
 
Sigma non-opioid intracellular receptor 1
Name:Sigma non-opioid intracellular receptor 1
Type:Protein
Mol. Mass.:25307.17
Organism:Cavia porcellus (Guinea pig)
Description:Q60492
Residue:223
BDBM21398
NameBDBM21398
Synonyms:4-[4-(4-Chloro-phenyl)-4-hydroxy-piperidin-1-yl]-1-(4-fluoro-phenyl)-butan-1-one;propionate(HCl) CHEMBL54 Haloperidol | Haloperidol, 1
TypeSmall organic molecule
Emp. Form.C21H23ClFNO2
Mol. Mass.375.864
SMILESOC1(CCN(CCCC(=O)c2ccc(F)cc2)CC1)c1ccc(Cl)cc1