Reaction Details
TargetSerine/threonine-protein kinase mTOR
LigandBDBM50243924
Substrate/Competitorn/a
Meas. Tech.ChEMBL_1672987 (CHEMBL4023016)
IC50 3±n/a nM
Citation Guo, QYu, CZhang, CLi, YWang, THuang, ZWang, XZhou, WLi, YQin, ZWang, CGao, RNie, YMa, YShi, YZheng, JYang, SFan, YXiang, R Highly Selective, Potent, and Oral mTOR Inhibitor for Treatment of Cancer as Autophagy Inducer. J Med Chem61:881-904 (2018) 
 
Serine/threonine-protein kinase mTOR
Name:Serine/threonine-protein kinase mTOR
Type:Rapamycin target protein
Mol. Mass.:288917.12
Organism:Homo sapiens (Human)
Description:P42345
Residue:2549
BDBM50243924
NameBDBM50243924
Synonyms:CHEMBL4075931
TypeSmall organic molecule
Emp. Form.C23H23N7O2
Mol. Mass.429.4744
SMILESNC(=O)CN1CCC(CC1)n1c2c(cnc3ccc(cc23)-c2ccc(N)nc2)ncc1=O