Reaction Details
TargetCarbonic anhydrase 1
LigandBDBM50163858
Substrate/Competitorn/a
Meas. Tech.ChEMBL_1673906 (CHEMBL4023935)
Kd 0.76±n/a nM
Citation Linkuvien?, VTalibov, VODanielson, UHMatulis, D Introduction of Intrinsic Kinetics of Protein-Ligand Interactions and Their Implications for Drug Design. J Med Chem61:2292-2302 (2018) 
 
Carbonic anhydrase 1
Name:Carbonic anhydrase 1
Type:PROTEIN
Mol. Mass.:28898.91
Organism:Equus caballus
Description:ChEMBL_117560
Residue:260
BDBM50163858
NameBDBM50163858
Synonyms:CHEMBL2443188 | carbonic anhydrase (CA) inhibitors, benzenesulphonamide ligand, 7
TypeSmall organic molecule
Emp. Form.C12H10ClN3O3S2
Mol. Mass.343.809
SMILESNS(=O)(=O)c1ccc(cc1Cl)C(=O)CSc1ncccn1