Reaction Details
TargetCarbonic anhydrase 1
LigandBDBM50163861
Substrate/Competitorn/a
Meas. Tech.ChEMBL_1673906 (CHEMBL4023935)
Kd 2.4±n/a nM
Citation Linkuvien?, VTalibov, VODanielson, UHMatulis, D Introduction of Intrinsic Kinetics of Protein-Ligand Interactions and Their Implications for Drug Design. J Med Chem61:2292-2302 (2018) 
 
Carbonic anhydrase 1
Name:Carbonic anhydrase 1
Type:PROTEIN
Mol. Mass.:28898.91
Organism:Equus caballus
Description:ChEMBL_117560
Residue:260
BDBM50163861
NameBDBM50163861
Synonyms:CHEMBL3799945 | carbonic anhydrase (CA) inhibitors, benzenesulphonamide ligand, 15
TypeSmall organic molecule
Emp. Form.C14H12F4N2O3S
Mol. Mass.364.315
SMILESCOc1ccc(CNc2c(F)c(F)c(F)c(F)c2S(N)(=O)=O)cc1