Reaction Details
TargetCarbonic anhydrase 12
LigandBDBM50031589
Substrate/Competitorn/a
Meas. Tech.ChEMBL_1673912 (CHEMBL4023941)
Kd 3.8±n/a nM
Citation Linkuvien?, VTalibov, VODanielson, UHMatulis, D Introduction of Intrinsic Kinetics of Protein-Ligand Interactions and Their Implications for Drug Design. J Med Chem61:2292-2302 (2018) 
 
Carbonic anhydrase 12
Name:Carbonic anhydrase 12
Type:Enzyme
Mol. Mass.:39456.00
Organism:Homo sapiens (Human)
Description:Catalytic domain of human cloned isozyme was used in the assay
Residue:354
BDBM50031589
NameBDBM50031589
Synonyms:CHEMBL3359179
TypeSmall organic molecule
Emp. Form.C16H23F3N2O3S2
Mol. Mass.412.491
SMILESNS(=O)(=O)c1c(F)c(F)c(SCCO)c(F)c1NC1CCCCCCC1