Reaction Details
Target5-hydroxytryptamine receptor 1A
LigandBDBM50081702
Substrate/Competitorn/a
Meas. Tech.ChEBML_593
IC50 140±n/a nM
Citation Macor, JEBlake, JFox, CBJohnson, CKoe, BKLebel, LAMorrone, JMRyan, KSchmidt, AWSchulz, DW Synthesis and serotonergic pharmacology of the enantiomers of 3-[(N-methylpyrrolidin-2-yl)methyl]-5-methoxy-1H-indole: discovery of stereogenic differentiation in the aminoethyl side chain of the neurotransmitter serotonin. J Med Chem35:4503-5 (1992) 5-hydroxytryptamine receptor 1A
Name:5-hydroxytryptamine receptor 1A
Type:n/a
Mol. Mass.:46122.49
Organism:Homo sapiens (Human)
Description:n/a
Residue:422
BDBM50081702
NameBDBM50081702
Synonyms:5-Methoxy-3-((S)-1-methyl-pyrrolidin-2-ylmethyl)-1H-indole | CHEMBL133939
TypeSmall organic molecule
Emp. Form.C15H20N2O
Mol. Mass.244.3321
SMILESCOc1ccc2[nH]cc(C[C@@H]3CCCN3C)c2c1