Reaction Details
TargetAdenosine receptor A1
LigandBDBM50230152
Substrate/Competitorn/a
Meas. Tech.ChEBML_29278
EC50 3548±n/a nM
Citation Niiya, KOlsson, RAThompson, RDSilvia, SKUeeda, M 2-(N'-alkylidenehydrazino)adenosines: potent and selective coronary vasodilators. J Med Chem35:4557-61 (1993) Adenosine receptor A1
Name:Adenosine receptor A1
Type:Enzyme Catalytic Domain
Mol. Mass.:36501.39
Organism:GUINEA PIG
Description:ADENOSINE A1 ADORA1 GUINEA PIG::P47745
Residue:326
BDBM50230152
NameBDBM50230152
Synonyms:Binodenoson MRE0470 | WRC-0470
TypeSmall organic molecule
Emp. Form.C17H25N7O4
Mol. Mass.391.4249
SMILESNc1nc(N\N=C\C2CCCCC2)nc2n(cnc12)[C@@H]1O[C@H](CO)[C@@H](O)[C@H]1O