Reaction Details
TargetAdenosine receptor A2a/A2b
LigandBDBM50421979
Substrate/Competitorn/a
Meas. Tech.ChEBML_27637
EC50 2.9±n/a nM
Citation Niiya, KOlsson, RAThompson, RDSilvia, SKUeeda, M 2-(N'-alkylidenehydrazino)adenosines: potent and selective coronary vasodilators. J Med Chem35:4557-61 (1993) Adenosine receptor A2a/A2b
Name:Adenosine receptor A2a/A2b
Synonyms:Adenosine A2 receptor
Type:n/a
Mol. Mass.:n/a
Description:ASSAY_ID of ChEMBL is 329906
Components:This complex has 2 components.
Component 1
Name:Adenosine receptor A2b
Type:G Protein-Coupled Receptor (GPCR)
Mol. Mass.:36341.22
Organism:Homo sapiens (Human)
Description:n/a
Residue:332
Component 2
Name:Adenosine receptor A2a
Synonyms:A2A adenosine receptor (hA2A) ADENOSINE A2 ADORA2 Adenosine A2A receptor (A2AAR)
Type:G Protein-Coupled Receptor (GPCR)
Mol. Mass.:44716.46
Organism:Homo sapiens (Human)
Description:P29274
Residue:412
BDBM50421979
NameBDBM50421979
Synonyms:CHEMBL607585
TypeSmall organic molecule
Emp. Form.C14H21N7O4
Mol. Mass.351.361
SMILESCCCCN=Nc1nc(N)c2ncn(C3O[C@H](CO)[C@@H](O)[C@H]3O)c2n1