Reaction Details
TargetSerine/threonine-protein kinase TNNI3K
LigandBDBM50245263
Substrate/Competitorn/a
Meas. Tech.ChEMBL_1674597 (CHEMBL4024626)
IC50 2000±n/a nM
Citation Philp, JLawhorn, BGGraves, APShewchuk, LRivera, KLJolivette, LJHolt, DAGatto, GJKallander, LS 4,6-Diaminopyrimidines as Highly Preferred Troponin I-Interacting Kinase (TNNI3K) Inhibitors. J Med Chem61:3076-3088 (2018) 
 
Serine/threonine-protein kinase TNNI3K
Name:Serine/threonine-protein kinase TNNI3K
Type:Enzyme Catalytic Domain
Mol. Mass.:92855.14
Organism:Homo sapiens (Human)
Description:gi_7705748
Residue:835
BDBM50245263
NameBDBM50245263
Synonyms:CHEMBL4086869
TypeSmall organic molecule
Emp. Form.C19H21N5O2S
Mol. Mass.383.467
SMILESCNS(=O)(=O)c1cccc(Nc2cc(ncn2)N(C)c2cccc(C)c2)c1